{"text_format":"1","workbook":"xlsx","n_sheets":17,"sheets":["All Goals 2018_19","All Penalties 2018_19","All Shootouts 2018_19","All Goalies 2018_19","Schedule","GP_GA PvtTbl","Penalties1","GP PvtTbl","GoalScoring1","Teams","Introduction","NHL_AllPlayers","TeamNation Dashboard","AgeHtWt Dashboard","AgeWtHt PvtTbl","TeamFlag PvtTbl","NHL_All PensOpp"],"not_rendered":{"charts":6,"images":35,"macros":1,"external_links":2,"defined_names":70,"comments":0,"pivot_tables":9},"unopened":[],"bounds":{"document_bytes":16777216,"sheet_cells":100000,"rows_first":2000,"rows_last":500,"rows_between":2000,"halvings":0,"cell_chars":16384,"cell_head_chars":4096},"cells_cut":0,"cells_raw":0,"read":"whole","date_system":"1900"}

{"sheet":"All Goals 2018_19","index":0,"n_rows":453,"n_cols":9,"rows_kept":453,"cut":false,"hidden":true,"merged":[[0,1,0,8]]}
[null,"Scoring Summary 2016-2017"]
[null,"Date","Per","Time","Team","SpecG","Goal Scorer","Primary Assist","Secondary Assist"]
[null,"2018-10-04",1,"01:49:00","PIT","ES","Jamie Oleksiak","Evgeni Malkin","Phil Kessel"]
[null,"2018-10-04",1,"03:30:00","WSH","ES","Jakub Vrana","Nicklas Backstrom","T.J. Oshie"]
[null,"2018-10-04",1,"04:18:00","WSH","ES","Brooks Orpik","x","x"]
[null,"2018-10-04",1,"07:27:00","PIT","PP","Jake Guentzel","Daniel Sprong","Justin Schultz"]
[null,"2018-10-04",1,"08:00:00","WSH","ES","Alex Ovechkin","Christian Djoos","Evgeny Kuznetsov"]
[null,"2018-10-04",2,"00:30:00","PIT","ES","Kris Letang","Sidney Crosby","Brian Dumoulin"]
[null,"2018-10-04",2,"03:54:00","WSH","ES","John Carlson","Brett Connolly","x"]
[null,"2018-10-04",2,"15:09:00","PIT","ES","Jake Guentzel","Justin Schultz","Patric Hornqvist"]
[null,"2018-10-04",2,"16:58:00","PIT","ES","Derick Brassard","Dominik Simon","Brian Dumoulin"]
[null,"2018-10-04",3,"02:45:00","PIT","ES","Evgeni Malkin","Kris Letang","Sidney Crosby"]
[null,"2018-10-04",3,"13:01:00","WSH","ES","T.J. Oshie","x","x"]
[null,"2018-10-04",3,"13:22:00","WSH","ES","T.J. Oshie","John Carlson","x"]
[null,"2018-10-04",4,"01:20:00","PIT","PP","Kris Letang","Evgeni Malkin","Phil Kessel"]
{"$rows_left_out":439}
{"sheet":"All Penalties 2018_19","index":1,"n_rows":506,"n_cols":8,"rows_kept":506,"cut":false,"hidden":true,"merged":[[0,1,0,7]]}
[null,"Penalty Statistics"]
[null,"Date","Period","Time","Team","Player","Penalty","Minutes"]
[null,"2018-10-04",1,"05:47:00","WSH","Matt Niskanen","Interference",2]
[null,"2018-10-04",1,"18:11:00","PIT","Carl Hagelin","Interference",2]
[null,"2018-10-04",2,"04:13:00","PIT","Phil Kessel","Slashing",2]
[null,"2018-10-04",2,"07:24:00","WSH","Lars Eller","Hooking",2]
[null,"2018-10-04",3,"00:39:00","WSH","Brett Connolly","Tripping",2]
[null,"2018-10-04",3,"03:53:00","WSH","Madison Bowey","Hooking",2]
[null,"2018-10-04",3,"08:40:00","WSH","Jakub Vrana","Slashing",2]
[null,"2018-10-04",4,"00:19:00","WSH","Evgeny Kuznetsov","Hooking",2]
[null,"2018-10-06",1,"01:59:00","MTL","Jesperi Kotkaniemi","Slashing ",2]
[null,"2018-10-06",1,"06:25:00","PIT","Dominik Simon","Delay of game ",2]
[null,"2018-10-06",2,"07:32:00","MTL","Xavier Ouellet","Tripping ",2]
[null,"2018-10-06",2,"13:16:00","MTL","Jesperi Kotkaniemi","Hooking ",2]
[null,"2018-10-06",2,"18:09:00","PIT","Carl Hagelin","Slashing ",2]
{"$rows_left_out":492}
{"sheet":"All Shootouts 2018_19","index":2,"n_rows":99,"n_cols":7,"rows_kept":99,"cut":false,"hidden":true,"merged":[[0,1,0,6]]}
[null,"Shootout Statistics"]
[null,"Date","Attempt","Team","Shooter","Goalie","Goal (1)/Save(0)"]
[null,"2018-10-13",1,"MTL","Casey DeSmith","Paul Byron",1]
[null,"2018-10-13",2,"PIT","Antti Niemi","Evgeni Malkin",0]
[null,"2018-10-13",3,"MTL","Casey DeSmith","Jonathan Drouin",1]
[null,"2018-10-13",4,"PIT","Antti Niemi","Sidney Crosby",0]
[null,"2018-11-01",1,"NYI","Matt Murray","Jordan Eberle",0]
[null,"2018-11-01",2,"PIT","Thomas Greiss","Evgeni Malkin",0]
[null,"2018-11-01",3,"NYI","Matt Murray","Brock Nelson",0]
[null,"2018-11-01",4,"PIT","Thomas Greiss","Sidney Crosby",0]
[null,"2018-11-01",5,"NYI","Matt Murray","Josh Bailey",1]
[null,"2018-11-01",6,"PIT","Thomas Greiss","Kris Letang",0]
[null,"2018-12-10",1,"NYI","Mathew Barzal","Casey DeSmith",0]
[null,"2018-12-10",2,"PIT","Phil Kessel","Robin Lehner",1]
[null,"2018-12-10",3,"NYI","Leo Komarov","Casey DeSmith",0]
{"$rows_left_out":85}
{"sheet":"All Goalies 2018_19","index":3,"n_rows":163,"n_cols":10,"rows_kept":163,"cut":false,"hidden":true,"merged":[[0,1,0,9],[0,11,0,26]]}
[null,"Goalie Statistics"]
[null,"Date","Team","Goalie","Dec (W/L)","GA","SOG","SV","SO","TOI"]
[null,"2018-10-04","WSH","Braden Holtby","OTL",7,41,34,0,2.5555555555555558]
[null,"2018-10-04","PIT","Matt Murray","Win",6,36,30,0,2.5555555555555558]
[null,"2018-10-06","MTL","Carey Price","Win",1,22,21,0,2.5]
[null,"2018-10-06","PIT","Matt Murray","Loss",5,29,24,0,2.4708333333333332]
[null,"2018-10-11","VEG","Malcolm Subban","Loss",4,22,18,0,2.4534722222222221]
[null,"2018-10-11","PIT","Casey DeSmith","Win",2,37,35,0,2.5]
[null,"2018-10-13","PIT","Casey DeSmith","OTL",3,40,37,0,2.7083333333333335]
[null,"2018-10-13","MTL","Antti Niemi","Win",3,28,25,0,2.7083333333333335]
[null,"2018-10-16","VAN","Anders Nilsson","Win",2,28,26,0,2.5236111111111112]
[null,"2018-10-16","PIT","Casey DeSmith","OTL",3,26,23,0,2.5236111111111112]
[null,"2018-10-18","PIT","Matt Murray","Win",0,38,38,1,2.5]
[null,"2018-10-18","TOR","Frederik Andersen","Loss",1,37,36,0,2.4270833333333335]
[null,"2018-10-23","PIT","Matt Murray","Win",5,46,41,0,2.5916666666666668]
{"$rows_left_out":149}
{"sheet":"Schedule","index":4,"n_rows":169,"n_cols":11,"rows_kept":169,"cut":false,"hidden":true,"merged":[[0,1,0,4]]}
[null,"2017-18 Season Schedule"]
["GP","Date","Time (EST)","Home/Away","Opponent","TeamAbr","Conferenc","Division"]
[1,"2018-10-04","19:00:00","Home","Washington Capitals","WSH","Western","Central"]
[2,"2018-10-06","19:00:00","Home","Montreal Canadiens","MTL","Western","Central"]
[3,"2018-10-11","19:00:00","Home","Vegas Golden Knights","VEG","Western","Central"]
[4,"2018-10-13","19:00:00","Away","Montreal Canadiens","MTL","Eastern","Metropolitan"]
[5,"2018-10-16","19:00:00","Home","Vancouver Canucks","VAN"]
[6,"2018-10-18","19:00:00","Away","Toronto Maple Leafs","TOR"]
[7,"2018-10-23","21:00:00","Away","Edmonton Oilers","EDM"]
[8,"2018-10-25","21:00:00","Away","Calgary Flames","CGY"]
[9,"2018-10-27","22:00:00","Away","Vancouver Canucks","VAN"]
[10,"2018-10-30","19:00:00","Home","New York Islanders","NYI"]
[11,"2018-11-01","19:00:00","Home","New York Islanders","NYI"]
[12,"2018-11-03","19:00:00","Home","Toronto Maple Leafs","TOR"]
[13,"2018-11-05","19:00:00","Home","New Jersey Devils","NJD"]
{"$rows_left_out":155}
{"sheet":"GP_GA PvtTbl","index":5,"n_rows":38,"n_cols":3,"rows_kept":38,"cut":false,"hidden":true,"merged":[]}
["Teams","Games Played","Goals"]
["Eastern",54,173]
["Atlantic",24,97]
["BOS",3,15]
["BUF",3,4]
["DET",3,22]
["FLA",3,9]
["MTL",3,10]
["OTT",3,7]
["TBL",3,17]
["TOR",3,13]
["Metropolitan",30,76]
["CAR",4,8]
["CBJ",4,11]
["NJD",5,13]
{"$rows_left_out":24}
{"sheet":"Penalties1","index":6,"n_rows":20,"n_cols":27,"rows_kept":20,"cut":false,"hidden":true,"merged":[[19,6,19,10],[9,0,9,14]]}
["Team","(All)",null,null,"Team","Player","Penalty",null,null,"Field","All"]
["Player","(All)",null,null,{"$f":"IF(COUNTIF(INDIRECT(\"PenaltyStats[\" & A1 & \"]\"),B1),B1,E4)","v":"*"},{"$f":"IF(COUNTIF(INDIRECT(\"PenaltyStats[\" & A2 & \"]\"),B2),B2,F4)","v":"*"},{"$f":"IF(COUNTIF(INDIRECT(\"PenaltyStats[\" & A3 & \"]\"),B3),B3,G4)","v":"*"},null,null,"Team","*"]
["Penalty","(All)",null,null,null,null,null,null,null,"Player","*"]
[null,null,null,null,{"$f":"INDEX(Penalties1!$K$2:$K$5,MATCH(E1,HeadingsListOp1,0))","v":"*"},{"$f":"INDEX(Penalties1!$K$2:$K$5,MATCH(F1,HeadingsListOp1,0))","v":"*"},{"$f":"INDEX(Penalties1!$K$2:$K$5,MATCH(G1,HeadingsListOp1,0))","v":"*"},null,null,"Penalty","*"]
[null,null,null,null,null,null,null,null,null,"Minutes","*"]
[]
[]
[]
[]
["Penalty Summary",null,null,null,null,null,null,null,null,null,null,null,null,null,null,null,null,null,null,null,null,null,null,null,null,null,"BUFlogo"]
[]
[]
[]
[]
[]
{"$rows_left_out":6}
{"sheet":"GP PvtTbl","index":7,"n_rows":40,"n_cols":2,"rows_kept":40,"cut":false,"hidden":true,"merged":[]}
[]
[]
["Row Labels","Sum of GP"]
["Eastern",54]
["Atlantic",24]
["BOS",3]
["BUF",3]
["DET",3]
["FLA",3]
["MTL",3]
["OTT",3]
["TBL",3]
["TOR",3]
["Metropolitan",30]
["CAR",4]
{"$rows_left_out":26}
{"sheet":"GoalScoring1","index":8,"n_rows":692,"n_cols":27,"rows_kept":692,"cut":false,"hidden":true,"merged":[[19,7,19,14],[9,0,9,14]]}
["Team","(All)",null,null,"Team","SpecG","Goal Scorer","Primary Assist","Secondary Assist",null,"Field","All"]
["SpecG","(All)",null,null,{"$f":"IF(COUNTIF(INDIRECT(\"Scoring2018_19[\" & A1 & \"]\"),B1),B1,E5)","v":"*"},{"$f":"IF(COUNTIF(INDIRECT(\"Scoring2018_19[\" & A2 & \"]\"),B2),B2,F5)","v":"*"},{"$f":"IF(COUNTIF(INDIRECT(\"Scoring2018_19[\" & A3 & \"]\"),B3),B3,G5)","v":"*"},{"$f":"IF(COUNTIF(INDIRECT(\"Scoring2018_19[\" & A4 & \"]\"),B4),B4,H5)","v":"*"},{"$f":"IF(COUNTIF(INDIRECT(\"Scoring2018_19[\" &A5 & \"]\"),B5),B5,I5)","v":"*"},null,"Team","*"]
["Goal Scorer","(All)",null,null,null,null,null,null,null,null,"SpecG","*"]
["Primary Assist","(All)",null,null,null,null,null,null,null,null,"Goal Scorer","*"]
["Secondary Assist","(All)",null,null,{"$f":"INDEX(tblHeadO1[[All]:[All]],MATCH(E1,HeadingsListO1,0))","v":"*"},{"$f":"INDEX(tblHeadO1[[All]:[All]],MATCH(F1,HeadingsListO1,0))","v":"*"},{"$f":"INDEX(tblHeadO1[[All]:[All]],MATCH(G1,HeadingsListO1,0))","v":"*"},{"$f":"INDEX(tblHeadO1[[All]:[All]],MATCH(H1,HeadingsListO1,0))","v":"*"},{"$f":"INDEX(tblHeadO1[[All]:[All]],MATCH(I1,HeadingsListO1,0))","v":"*"},null,"Primary Assist","*"]
[null,null,null,null,null,null,null,null,null,null,"Secondary Assist","*"]
[]
[]
[]
[" Scoring Summary",null,null,null,null,null,null,null,null,null,null,null,null,null,null,null,null,null,null,null,null,null,null,null,null,null,"CARlogo"]
[]
[]
[]
[]
[]
{"$rows_left_out":678}
{"sheet":"Teams","index":9,"n_rows":32,"n_cols":20,"rows_kept":32,"cut":false,"hidden":true,"merged":[]}
["Team","TAbrv","Conference","Division","Logo",null,null,null,null,null,null,null,null,null,null,null,null,null,"TAbrv","Team"]
["Anaheim Ducks","ANA","Western","Pacific",null,null,null,null,null,null,null,null,null,null,null,null,null,null,"ANA","Anaheim Ducks"]
["Arizona Coyotes","ARI","Western","Pacific",null,null,null,null,null,null,null,null,null,null,null,null,null,null,"ARI","Arizona Coyotes"]
["Boston Bruins","BOS","Eastern","Atlantic",null,null,"ANA",null,"CHI",null,"FLA",null,"NYI",null,"STL",null,null,null,"BOS","Boston Bruins"]
["Buffalo Sabres","BUF","Eastern","Atlantic",null,null,null,null,null,null,null,null,null,null,null,null,null,null,"BUF","Buffalo Sabres"]
["Calgary Flames","CGY","Western","Pacific",null,null,null,null,null,null,null,null,null,null,null,null,null,null,"CGY","Calgary Flames"]
["Carolina Hurricanes","CAR","Eastern","Metropolitan",null,null,null,null,null,null,null,null,null,null,null,null,null,null,"CAR","Carolina Hurricanes"]
["Chicago Blackhawks","CHI","Western","Central",null,null,"ARI",null,"COL",null,"LAK",null,"NYR",null,"TBL",null,null,null,"CHI","Chicago Blackhawks"]
["Colorado Avalanche","COL","Western","Central",null,null,null,null,null,null,null,null,null,null,null,null,null,null,"COL","Colorado Avalanche"]
["Columbus Blue Jackets","CBJ","Eastern","Metropolitan",null,null,null,null,null,null,null,null,null,null,null,null,null,null,"CBJ","Columbus Blue Jackets"]
["Dallas Stars","DAL","Western","Central",null,null,null,null,null,null,null,null,null,null,null,null,null,null,"DAL","Dallas Stars"]
["Detroit Red Wings","DET","Eastern","Atlantic",null,null,"BOS",null,"CBJ",null,"MIN",null,"OTT",null,"TOR",null,null,null,"DET","Detroit Red Wings"]
["Edmonton Oilers","EDM","Western","Pacific",null,null,null,null,null,null,null,null,null,null,null,null,null,null,"EDM","Edmonton Oilers"]
["Florida Panthers","FLA","Eastern","Metropolitan",null,null,null,null,null,null,null,null,null,null,null,null,null,null,"FLA","Florida Panthers"]
["Los Angeles Kings","LAK","Western","Pacific",null,null,null,null,null,null,null,null,null,null,null,null,null,null,"LAK","Los Angeles Kings"]
{"$rows_left_out":18}
{"sheet":"Introduction","index":10,"n_rows":1,"n_cols":1,"rows_kept":1,"cut":false,"hidden":false,"merged":[[0,0,0,20]]}
["Opposition Statistics for Pittsburgh Penguins"]

{"sheet":"NHL_AllPlayers","index":11,"n_rows":718,"n_cols":19,"rows_kept":718,"cut":false,"hidden":true,"merged":[]}
[]
["Team","Conference","Division","Player","No.","Flag","Pos","Ht","Wt","S/C","Exp","Birth Date","Age","Salary","Goals","PriAsst","SecAsst","Assists","Points"]
["ANA","Western","Pacific","Andrew Cogliano",7,"CAN","LW",30,"5'10\"",177,"L/-",10,"1987-06-14",3300000,{"$f":"COUNTIF(Scoring2018_19[Goal Scorer],$D3)","v":1},{"$f":"COUNTIF(Scoring2018_19[Primary Assist],$D3)","v":1},{"$f":"COUNTIF(Scoring2018_19[Secondary Assist],$D3)","v":0},{"$f":"P3+Q3","v":1},{"$f":"O3+R3","v":2}]
["ANA","Western","Pacific","Antoine Vermette",50,"CAN","C",35,"6'1\"",197,"L/-",13,"1982-07-20",1750000,{"$f":"COUNTIF(Scoring2018_19[Goal Scorer],$D4)","v":0},{"$f":"COUNTIF(Scoring2018_19[Primary Assist],$D4)","v":0},{"$f":"COUNTIF(Scoring2018_19[Secondary Assist],$D4)","v":0},{"$f":"P4+Q4","v":0},{"$f":"O4+R4","v":0}]
["ANA","Western","Pacific","Brandon Montour",26,"CAN","D",23,"6'0\"",192,"R/-",1,"1994-04-11",70000,{"$f":"COUNTIF(Scoring2018_19[Goal Scorer],$D5)","v":1},{"$f":"COUNTIF(Scoring2018_19[Primary Assist],$D5)","v":0},{"$f":"COUNTIF(Scoring2018_19[Secondary Assist],$D5)","v":1},1,2]
["ANA","Western","Pacific","Cam Fowler",4,"CAN","D",26,"6'1\"",215,"L/-",7,"1991-12-05",4000000,{"$f":"COUNTIF(Scoring2018_19[Goal Scorer],$D6)","v":0},{"$f":"COUNTIF(Scoring2018_19[Primary Assist],$D6)","v":0},{"$f":"COUNTIF(Scoring2018_19[Secondary Assist],$D6)","v":0},0,0]
["ANA","Western","Pacific","Chris Wagner",21,"USA","C",26,"6'0\"",198,"R/-",3,"1991-05-27",650000,{"$f":"COUNTIF(Scoring2018_19[Goal Scorer],$D7)","v":1},{"$f":"COUNTIF(Scoring2018_19[Primary Assist],$D7)","v":1},{"$f":"COUNTIF(Scoring2018_19[Secondary Assist],$D7)","v":0},1,2]
["ANA","Western","Pacific","Corey Perry",10,"CAN","RW",32,"6'3\"",213,"R/-",12,"1985-05-16",10000000,{"$f":"COUNTIF(Scoring2018_19[Goal Scorer],$D8)","v":0},{"$f":"COUNTIF(Scoring2018_19[Primary Assist],$D8)","v":0},{"$f":"COUNTIF(Scoring2018_19[Secondary Assist],$D8)","v":0},0,0]
["ANA","Western","Pacific","Dennis Rasmussen",22,"SWE","C",27,"6'3\"",192,"R/-",2,"1990-07-03",725000,{"$f":"COUNTIF(Scoring2018_19[Goal Scorer],$D9)","v":0},{"$f":"COUNTIF(Scoring2018_19[Primary Assist],$D9)","v":0},{"$f":"COUNTIF(Scoring2018_19[Secondary Assist],$D9)","v":0},0,0]
["ANA","Western","Pacific","Derek Grant",38,"CAN","C",27,"6'3\"",215,"L/-",4,"1990-04-20",650000,{"$f":"COUNTIF(Scoring2018_19[Goal Scorer],$D10)","v":2},{"$f":"COUNTIF(Scoring2018_19[Primary Assist],$D10)","v":3},{"$f":"COUNTIF(Scoring2018_19[Secondary Assist],$D10)","v":0},3,5]
["ANA","Western","Pacific","Francois Beauchemin",23,"CAN","D",37,"5'11\"",208,"L/-",13,"1980-06-04","N/A",{"$f":"COUNTIF(Scoring2018_19[Goal Scorer],$D11)","v":0},{"$f":"COUNTIF(Scoring2018_19[Primary Assist],$D11)","v":0},{"$f":"COUNTIF(Scoring2018_19[Secondary Assist],$D11)","v":0},0,0]
["ANA","Western","Pacific","Giovanni Fiore",90,"CAN","LW",21,"6'1\"",193,"L/-","R","1996-08-13",70000,{"$f":"COUNTIF(Scoring2018_19[Goal Scorer],$D12)","v":0},{"$f":"COUNTIF(Scoring2018_19[Primary Assist],$D12)","v":0},{"$f":"COUNTIF(Scoring2018_19[Secondary Assist],$D12)","v":0},0,0]
["ANA","Western","Pacific","Hampus Lindholm",47,"SWE","D",24,"6'3\"",208,"L/-",4,"1994-01-20","N/A",{"$f":"COUNTIF(Scoring2018_19[Goal Scorer],$D13)","v":0},{"$f":"COUNTIF(Scoring2018_19[Primary Assist],$D13)","v":0},{"$f":"COUNTIF(Scoring2018_19[Secondary Assist],$D13)","v":0},{"$f":"P13+Q13","v":0},{"$f":"O13+R13","v":0}]
["ANA","Western","Pacific","Jakob Silfverberg",33,"SWE","RW",27,"6'2\"",202,"R/-",5,"1990-10-13",3750000,{"$f":"COUNTIF(Scoring2018_19[Goal Scorer],$D14)","v":1},{"$f":"COUNTIF(Scoring2018_19[Primary Assist],$D14)","v":0},{"$f":"COUNTIF(Scoring2018_19[Secondary Assist],$D14)","v":0},0,1]
["ANA","Western","Pacific","Jared Boll",40,"USA","RW",31,"6'3\"",206,"R/-",10,"1986-05-13",900000,{"$f":"COUNTIF(Scoring2018_19[Goal Scorer],$D15)","v":0},{"$f":"COUNTIF(Scoring2018_19[Primary Assist],$D15)","v":0},{"$f":"COUNTIF(Scoring2018_19[Secondary Assist],$D15)","v":0},0,0]
{"$rows_left_out":704}
{"sheet":"TeamNation Dashboard","index":12,"n_rows":1,"n_cols":1,"rows_kept":1,"cut":false,"hidden":true,"merged":[[0,0,0,20]]}
["Opponent Scoring by Team and Nationality"]

{"sheet":"AgeHtWt Dashboard","index":13,"n_rows":0,"n_cols":0,"rows_kept":0,"cut":false,"hidden":true,"merged":[]}

{"sheet":"AgeWtHt PvtTbl","index":14,"n_rows":259,"n_cols":11,"rows_kept":259,"cut":false,"hidden":true,"merged":[]}
[]
[]
["Row Labels","Sum of Penalties","Sum of Minutes",null,"Row Labels","Sum of Penalties","Sum of Minutes",null,"Row Labels","Sum of Penalties","Sum of Minutes"]
["Eastern",190,438,null,"Eastern",190,438,null,"Eastern",190,438]
["Atlantic",101,229,null,"Atlantic",101,229,null,"Atlantic",101,229]
[18,1,2,null,160,0,0,null,"5'07\"",1,2]
[19,0,0,null,166,0,0,null,"5'08\"",1,2]
[20,3,6,null,169,0,0,null,"5'09\"",5,10]
[21,9,23,null,170,0,0,null,"5'10\"",4,8]
[22,4,8,null,171,1,2,null,"5'11\"",16,38]
[23,3,8,null,172,1,2,null,"6'0\"",15,32]
[24,20,48,null,174,0,0,null,"6'1\"",23,50]
[25,10,20,null,175,0,0,null,"6'2\"",13,29]
[26,10,23,null,176,0,0,null,"6'3\"",10,23]
[27,3,9,null,177,0,0,null,"6'4\"",3,6]
{"$rows_left_out":245}
{"sheet":"TeamFlag PvtTbl","index":15,"n_rows":59,"n_cols":5,"rows_kept":59,"cut":false,"hidden":true,"merged":[]}
[]
[]
["Row Labels","Sum of Goals",null,"Row Labels","Sum of Goals"]
["Eastern",173,null,"Eastern",173]
["Atlantic",97,null,"Atlantic",97]
["BOS",15,null,"AUS",0]
["BUF",4,null,"CAN",56]
["DET",22,null,"CZR",8]
["FLA",9,null,"DEN",2]
["MTL",10,null,"FIN",2]
["OTT",7,null,"FRA",0]
["TBL",17,null,"LAT",0]
["TOR",13,null,"NOR",0]
["Metropolitan",76,null,"RUS",6]
["CAR",8,null,"SVK",0]
{"$rows_left_out":45}
{"sheet":"NHL_All PensOpp","index":16,"n_rows":674,"n_cols":21,"rows_kept":674,"cut":false,"hidden":true,"merged":[]}
[]
["Team","Conference","Division","Player","NOR.","Flag","Pos","Age","Ht","Wt","S/C","Exp","Birth Date","Salary","Goals","PriAsst","SecAsst","Assists","Points","Penalties","Minutes"]
["ANA","Western","Pacific","Adam Henrique",14,"CAN","C",28,"6'0\"",197,"L",8,"1990-02-06",5500000,{"$f":"COUNTIF(Scoring2018_19[Goal Scorer],$D3)","v":1},{"$f":"COUNTIF(Scoring2018_19[Primary Assist],$D3)","v":2},{"$f":"COUNTIF(Scoring2018_19[Secondary Assist],$D3)","v":1},{"$f":"P3+Q3","v":3},{"$f":"O3+R3","v":4},{"$f":"COUNTIF(PenaltyStats[Player],OppStats[[#This Row],[Player]])","v":0},{"$f":"SUMIF(PenaltyStats[Player],OppStats[[#This Row],[Player]],PenaltyStats[Minutes])","v":0}]
["ANA","Western","Pacific","Andrej Sustr",62,"CZR","D",28,"6'7\"",217,"R",6,"1990-11-29",1300000,{"$f":"COUNTIF(Scoring2018_19[Goal Scorer],$D4)","v":0},{"$f":"COUNTIF(Scoring2018_19[Primary Assist],$D4)","v":0},{"$f":"COUNTIF(Scoring2018_19[Secondary Assist],$D4)","v":0},0,0,{"$f":"COUNTIF(PenaltyStats[Player],OppStats[[#This Row],[Player]])","v":0},{"$f":"SUMIF(PenaltyStats[Player],OppStats[[#This Row],[Player]],PenaltyStats[Minutes])","v":0}]
["ANA","Western","Pacific","Andrew Cogliano",7,"CAN","LW",31,"5'10\"",177,"L",11,"1987-06-14",3250000,{"$f":"COUNTIF(Scoring2018_19[Goal Scorer],$D5)","v":1},{"$f":"COUNTIF(Scoring2018_19[Primary Assist],$D5)","v":1},{"$f":"COUNTIF(Scoring2018_19[Secondary Assist],$D5)","v":0},1,2,{"$f":"COUNTIF(PenaltyStats[Player],OppStats[[#This Row],[Player]])","v":1},{"$f":"SUMIF(PenaltyStats[Player],OppStats[[#This Row],[Player]],PenaltyStats[Minutes])","v":2}]
["ANA","Western","Pacific","Ben Street",46,"CAN","C",31,"6'0\"",190,"L",5,"1987-02-13",750000,{"$f":"COUNTIF(Scoring2018_19[Goal Scorer],$D6)","v":0},{"$f":"COUNTIF(Scoring2018_19[Primary Assist],$D6)","v":0},{"$f":"COUNTIF(Scoring2018_19[Secondary Assist],$D6)","v":0},0,0,{"$f":"COUNTIF(PenaltyStats[Player],OppStats[[#This Row],[Player]])","v":0},{"$f":"SUMIF(PenaltyStats[Player],OppStats[[#This Row],[Player]],PenaltyStats[Minutes])","v":0}]
["ANA","Western","Pacific","Brandon Montour",26,"CAN","D",24,"6'0\"",193,"R",2,"1994-04-11","N/A",{"$f":"COUNTIF(Scoring2018_19[Goal Scorer],$D7)","v":1},{"$f":"COUNTIF(Scoring2018_19[Primary Assist],$D7)","v":0},{"$f":"COUNTIF(Scoring2018_19[Secondary Assist],$D7)","v":1},1,2,{"$f":"COUNTIF(PenaltyStats[Player],OppStats[[#This Row],[Player]])","v":1},{"$f":"SUMIF(PenaltyStats[Player],OppStats[[#This Row],[Player]],PenaltyStats[Minutes])","v":2}]
["ANA","Western","Pacific","Brian Gibbons",23,"USA","C",30,"5'8\"",175,"L",3,"1988-02-26",1000000,{"$f":"COUNTIF(Scoring2018_19[Goal Scorer],$D8)","v":0},{"$f":"COUNTIF(Scoring2018_19[Primary Assist],$D8)","v":0},{"$f":"COUNTIF(Scoring2018_19[Secondary Assist],$D8)","v":0},0,0,{"$f":"COUNTIF(PenaltyStats[Player],OppStats[[#This Row],[Player]])","v":0},{"$f":"SUMIF(PenaltyStats[Player],OppStats[[#This Row],[Player]],PenaltyStats[Minutes])","v":0}]
["ANA","Western","Pacific","Cam Fowler",4,"CAN","D",27,"6'2\"",206,"L",8,"1991-12-05",7500000,{"$f":"COUNTIF(Scoring2018_19[Goal Scorer],$D9)","v":0},{"$f":"COUNTIF(Scoring2018_19[Primary Assist],$D9)","v":0},{"$f":"COUNTIF(Scoring2018_19[Secondary Assist],$D9)","v":0},0,0,{"$f":"COUNTIF(PenaltyStats[Player],OppStats[[#This Row],[Player]])","v":0},{"$f":"SUMIF(PenaltyStats[Player],OppStats[[#This Row],[Player]],PenaltyStats[Minutes])","v":0}]
["ANA","Western","Pacific","Carter Rowney",24,"CAN","RW",29,"6'2\"",206,"R",2,"1989-05-10",1400000,{"$f":"COUNTIF(Scoring2018_19[Goal Scorer],$D10)","v":0},{"$f":"COUNTIF(Scoring2018_19[Primary Assist],$D10)","v":1},{"$f":"COUNTIF(Scoring2018_19[Secondary Assist],$D10)","v":0},1,1,{"$f":"COUNTIF(PenaltyStats[Player],OppStats[[#This Row],[Player]])","v":1},{"$f":"SUMIF(PenaltyStats[Player],OppStats[[#This Row],[Player]],PenaltyStats[Minutes])","v":2}]
["ANA","Western","Pacific","Hampus Lindholm",47,"SWE","D",25,"6'3\"",211,"L",5,"1994-01-20",6750000,{"$f":"COUNTIF(Scoring2018_19[Goal Scorer],$D11)","v":0},{"$f":"COUNTIF(Scoring2018_19[Primary Assist],$D11)","v":0},{"$f":"COUNTIF(Scoring2018_19[Secondary Assist],$D11)","v":0},0,0,{"$f":"COUNTIF(PenaltyStats[Player],OppStats[[#This Row],[Player]])","v":0},{"$f":"SUMIF(PenaltyStats[Player],OppStats[[#This Row],[Player]],PenaltyStats[Minutes])","v":0}]
["ANA","Western","Pacific","Isac Lundestrom",48,"SWE","C",19,"6'0\"",187,"L",1,"1999-11-06","N/A",{"$f":"COUNTIF(Scoring2018_19[Goal Scorer],$D12)","v":0},{"$f":"COUNTIF(Scoring2018_19[Primary Assist],$D12)","v":0},{"$f":"COUNTIF(Scoring2018_19[Secondary Assist],$D12)","v":0},0,0,{"$f":"COUNTIF(PenaltyStats[Player],OppStats[[#This Row],[Player]])","v":0},{"$f":"SUMIF(PenaltyStats[Player],OppStats[[#This Row],[Player]],PenaltyStats[Minutes])","v":0}]
["ANA","Western","Pacific","Jakob Silfverberg",33,"SWE","RW",28,"6'1\"",204,"R",6,"1990-10-13",3750000,{"$f":"COUNTIF(Scoring2018_19[Goal Scorer],$D13)","v":1},{"$f":"COUNTIF(Scoring2018_19[Primary Assist],$D13)","v":0},{"$f":"COUNTIF(Scoring2018_19[Secondary Assist],$D13)","v":0},0,1,{"$f":"COUNTIF(PenaltyStats[Player],OppStats[[#This Row],[Player]])","v":0},{"$f":"SUMIF(PenaltyStats[Player],OppStats[[#This Row],[Player]],PenaltyStats[Minutes])","v":0}]
["ANA","Western","Pacific","John Gibson",36,"USA","G",25,"6'2\"",206,"L",5,"1993-07-14",3300000,{"$f":"COUNTIF(Scoring2018_19[Goal Scorer],$D14)","v":0},{"$f":"COUNTIF(Scoring2018_19[Primary Assist],$D14)","v":0},{"$f":"COUNTIF(Scoring2018_19[Secondary Assist],$D14)","v":0},0,0,{"$f":"COUNTIF(PenaltyStats[Player],OppStats[[#This Row],[Player]])","v":0},{"$f":"SUMIF(PenaltyStats[Player],OppStats[[#This Row],[Player]],PenaltyStats[Minutes])","v":0}]
["ANA","Western","Pacific","Joseph Blandisi",39,"CAN","C",24,"5'11\"",187,"L",3,"1994-07-18",135000,{"$f":"COUNTIF(Scoring2018_19[Goal Scorer],$D15)","v":0},{"$f":"COUNTIF(Scoring2018_19[Primary Assist],$D15)","v":0},{"$f":"COUNTIF(Scoring2018_19[Secondary Assist],$D15)","v":0},0,0,{"$f":"COUNTIF(PenaltyStats[Player],OppStats[[#This Row],[Player]])","v":0},{"$f":"SUMIF(PenaltyStats[Player],OppStats[[#This Row],[Player]],PenaltyStats[Minutes])","v":0}]
{"$rows_left_out":659}